Gcc [trunk revision 177684] failed to bootstrap on x86_64!

classic Classic list List threaded Threaded
1 message Options
Reply | Threaded
Open this post in threaded view
|

Gcc [trunk revision 177684] failed to bootstrap on x86_64!

H.J. Lu (X86 SPEC CPU)
cd bld; \
 RUNTESTFLAGS="--target_board='unix{-m32,}'" ../src-trunk/configure \
         --prefix=/export/gnu/import/svn/gcc-test-spec/usr --enable-clocale=gnu --with-system-zlib --enable-shared --with-demangler-in-ld --with-fpmath=sse --enable-languages=c,c++,fortran,lto
checking build system type... x86_64-unknown-linux-gnu
checking host system type... x86_64-unknown-linux-gnu
checking target system type... x86_64-unknown-linux-gnu
checking for a BSD-compatible install... /usr/bin/install -c
    grep "Error " makelog.177684.trunk.x86_64 >> makelog.177684.trunk.x86_64.mail; \
make[4]: *** [configure-target-libgfortran] Error 1
make[3]: *** [bootstrap] Error 2
make[2]: *** [bootstrap] Error 2
checking for ynf in -lm... /export/gnu/import/svn/gcc-test-spec/src-trunk/libgfortran/configure: line 1761: conftest.err: No space left on device
no
checking for yn in -lm... /export/gnu/import/svn/gcc-test-spec/src-trunk/libgfortran/configure: line 1761: conftest.err: No space left on device
no
checking for ynl in -lm... /export/gnu/import/svn/gcc-test-spec/src-trunk/libgfortran/configure: line 1761: conftest.err: No space left on device
no
checking for tgamma in -lm... /export/gnu/import/svn/gcc-test-spec/src-trunk/libgfortran/configure: line 1761: conftest.err: No space left on device
no
checking for tgammaf in -lm... /export/gnu/import/svn/gcc-test-spec/src-trunk/libgfortran/configure: line 1761: conftest.err: No space left on device
no
checking for tgammal in -lm... /export/gnu/import/svn/gcc-test-spec/src-trunk/libgfortran/configure: line 1761: conftest.err: No space left on device
no
checking for lgamma in -lm... /export/gnu/import/svn/gcc-test-spec/src-trunk/libgfortran/configure: line 1761: conftest.err: No space left on device
no
checking for lgammaf in -lm... /export/gnu/import/svn/gcc-test-spec/src-trunk/libgfortran/configure: line 1761: conftest.err: No space left on device
no
checking for lgammal in -lm... /export/gnu/import/svn/gcc-test-spec/src-trunk/libgfortran/configure: line 1761: conftest.err: No space left on device
no
checking for cacos in -lm... /export/gnu/import/svn/gcc-test-spec/src-trunk/libgfortran/configure: line 1761: conftest.err: No space left on device
no
checking for cacosf in -lm... /export/gnu/import/svn/gcc-test-spec/src-trunk/libgfortran/configure: line 1761: conftest.err: No space left on device
no
checking for cacosh in -lm... /export/gnu/import/svn/gcc-test-spec/src-trunk/libgfortran/configure: line 1761: conftest.err: No space left on device
no
checking for cacoshf in -lm... /export/gnu/import/svn/gcc-test-spec/src-trunk/libgfortran/configure: line 1761: conftest.err: No space left on device
no
checking for cacoshl in -lm... /export/gnu/import/svn/gcc-test-spec/src-trunk/libgfortran/configure: line 1761: conftest.err: No space left on device
no
checking for cacosl in -lm... /export/gnu/import/svn/gcc-test-spec/src-trunk/libgfortran/configure: line 1761: conftest.err: No space left on device
no
checking for casin in -lm... /export/gnu/import/svn/gcc-test-spec/src-trunk/libgfortran/configure: line 1761: conftest.err: No space left on device
no
checking for casinf in -lm... /export/gnu/import/svn/gcc-test-spec/src-trunk/libgfortran/configure: line 1761: conftest.err: No space left on device
no
checking for casinh in -lm... /export/gnu/import/svn/gcc-test-spec/src-trunk/libgfortran/configure: line 1761: conftest.err: No space left on device
no
checking for casinhf in -lm... /export/gnu/import/svn/gcc-test-spec/src-trunk/libgfortran/configure: line 1761: conftest.err: No space left on device
no
checking for casinhl in -lm... /export/gnu/import/svn/gcc-test-spec/src-trunk/libgfortran/configure: line 1761: conftest.err: No space left on device
no
checking for casinl in -lm... /export/gnu/import/svn/gcc-test-spec/src-trunk/libgfortran/configure: line 1761: conftest.err: No space left on device
no
checking for catan in -lm... /export/gnu/import/svn/gcc-test-spec/src-trunk/libgfortran/configure: line 1761: conftest.err: No space left on device
no
checking for catanf in -lm... /export/gnu/import/svn/gcc-test-spec/src-trunk/libgfortran/configure: line 1761: conftest.err: No space left on device
no
checking for catanh in -lm... /export/gnu/import/svn/gcc-test-spec/src-trunk/libgfortran/configure: line 1761: conftest.err: No space left on device
no
checking for catanhf in -lm... /export/gnu/import/svn/gcc-test-spec/src-trunk/libgfortran/configure: line 1761: conftest.err: No space left on device
no
checking for catanhl in -lm... /export/gnu/import/svn/gcc-test-spec/src-trunk/libgfortran/configure: line 1761: conftest.err: No space left on device
no
checking for catanl in -lm... /export/gnu/import/svn/gcc-test-spec/src-trunk/libgfortran/configure: line 1761: conftest.err: No space left on device
no
checking for __clog in -lm... /export/gnu/import/svn/gcc-test-spec/src-trunk/libgfortran/configure: line 1761: conftest.err: No space left on device
no
checking whether the target stat is reliable... no
checking whether __mingw_snprintf is present... /export/gnu/import/svn/gcc-test-spec/src-trunk/libgfortran/configure: line 1761: conftest.err: No space left on device
no
checking whether powf is broken... no
checking whether we have a usable __float128 type... /export/gnu/import/svn/gcc-test-spec/src-trunk/libgfortran/configure: line 1761: conftest.err: No space left on device
no
checking for feenableexcept in -lm... /export/gnu/import/svn/gcc-test-spec/src-trunk/libgfortran/configure: line 1761: conftest.err: No space left on device
no
checking for clock_gettime in -lrt... /export/gnu/import/svn/gcc-test-spec/src-trunk/libgfortran/configure: line 1761: conftest.err: No space left on device
no
checking whether fpsetmask is present... /export/gnu/import/svn/gcc-test-spec/src-trunk/libgfortran/configure: line 1761: conftest.err: No space left on device
no
checking for fp_trap... /export/gnu/import/svn/gcc-test-spec/src-trunk/libgfortran/configure: line 1761: conftest.err: No space left on device
no
checking for fp_enable... /export/gnu/import/svn/gcc-test-spec/src-trunk/libgfortran/configure: line 1761: conftest.err: No space left on device
no
configure: FPU dependent file will be fpu-387.h
checking POSIX version of getpwuid_r with 5 arguments... /export/gnu/import/svn/gcc-test-spec/src-trunk/libgfortran/configure: line 1761: conftest.err: No space left on device
no
checking whether the target supports hidden visibility... /export/gnu/import/svn/gcc-test-spec/src-trunk/libgfortran/configure: line 1526: conftest.err: No space left on device
no
checking whether the target supports dllexport... /export/gnu/import/svn/gcc-test-spec/src-trunk/libgfortran/configure: line 1526: conftest.err: No space left on device
no
checking whether the target supports symbol aliases... /export/gnu/import/svn/gcc-test-spec/src-trunk/libgfortran/configure: line 1761: conftest.err: No space left on device
no
checking whether the target supports __sync_fetch_and_add... /export/gnu/import/svn/gcc-test-spec/src-trunk/libgfortran/configure: line 1761: conftest.err: No space left on device
no
checking configured target thread model... posix
checking whether pragma weak works... /export/gnu/import/svn/gcc-test-spec/src-trunk/libgfortran/configure: line 1526: conftest.err: No space left on device
no
checking whether the target can unlink an open file... no
checking whether the target has CRLF as line terminator... no
configure: updating cache ./config.cache
configure: creating ./config.status
/export/gnu/import/svn/gcc-test-spec/src-trunk/libgfortran/configure: line 27191: conf29832subs.sh: No space left on device
configure: error: could not make ./config.status
make[4]: *** [configure-target-libgfortran] Error 1
make[4]: Leaving directory `/export/gnu/import/svn/gcc-test-spec/bld'
make[3]: *** [bootstrap] Error 2
make[3]: Leaving directory `/export/gnu/import/svn/gcc-test-spec/bld'
8363.44user 390.63system 43:19.74elapsed 336%CPU (0avgtext+0avgdata 395036maxresident)k
841048inputs+14348944outputs (7971major+150696160minor)pagefaults 0swaps
make[2]: *** [bootstrap] Error 2
make[2]: Leaving directory `/export/gnu/import/svn/gcc-test-spec'